Remove this ad

Lead

May 9 14 8:13 PM

Tags : :

Hi all.

I have the latest SVN release, got it from: https://code.google.com/p/amule/source/checkout

The compilation was successful for my understand, I compiled with this settings because I only need to build daemon and webserver. The problem was when I'm trying to type MAKE comand.

[code]hp@srv-01:~/amule/amule-read-only$ sudo ./configure --disable-monolithic --with-toolkit=base --enable-amule-daemon --enable-amulecmd --enable-webserver
checking for a BSD-compatible install... /usr/bin/install -c
checking whether build environment is sane... yes
checking for a thread-safe mkdir -p... /bin/mkdir -p
checking for gawk... no
checking for mawk... mawk
checking whether make sets $(MAKE)... yes
checking whether make supports nested variables... yes
checking whether make supports nested variables... (cached) yes
checking whether to enable maintainer-specific portions of Makefiles... no
checking build system type... x86_64-unknown-linux-gnu
checking host system type... x86_64-unknown-linux-gnu
checking if this is a FreeBSD 4 or earlier system... no
checking for g++... g++
checking whether the C++ compiler works... yes
checking for C++ compiler default output file name... a.out
checking for suffix of executables...
checking whether we are cross compiling... no
checking for suffix of object files... o
checking whether we are using the GNU C++ compiler... yes
checking whether g++ accepts -g... yes
checking for style of include used by make... GNU
checking dependency style of g++... gcc3
checking how to run the C++ preprocessor... g++ -E
checking for gcc... gcc
checking whether we are using the GNU C compiler... yes
checking whether gcc accepts -g... yes
checking for gcc option to accept ISO C89... none needed
checking whether gcc understands -c and -o together... yes
checking dependency style of gcc... gcc3
checking how to run the C preprocessor... gcc -E
checking for gawk... (cached) mawk
checking for grep that handles long lines and -e... /bin/grep
checking for egrep... /bin/grep -E
checking whether make sets $(MAKE)... (cached) yes
checking for flex... no
checking for lex... no
checking for ranlib... ranlib
checking for a sed that does not truncate output... /bin/sed
checking for bison... no
checking for byacc... no
checking for ranlib... (cached) ranlib
checking for strip... strip
checking for ar... ar
checking for ld... ld
checking for zlib >= 1.1.4... yes (version 1.2.8)
checking for ANSI C header files... yes
checking for sys/types.h... yes
checking for sys/stat.h... yes
checking for stdlib.h... yes
checking for string.h... yes
checking for memory.h... yes
checking for strings.h... yes
checking for inttypes.h... yes
checking for stdint.h... yes
checking for unistd.h... yes
checking for libpng-config... /usr/bin/libpng-config
checking for libpng version >= 1.2.0... yes (version 1.2.50)
checking if libpng is usable... yes
checking for File::Copy... ok
checking for the --with-toolkit option... base
checking for the --with-wxshared option... will be automatically detected
checking for the --with-wxdebug option... will be automatically detected
checking for the --with-wxversion option... will be automatically detected
checking for wx-config... /usr/local/bin/wx-config
checking for wxWidgets version >= 2.8.12 (--unicode=yes --toolkit=base)... yes (version 2.8.12)
checking if wxWidgets was built in DEBUG mode... yes
checking if wxWidgets was built in STATIC mode... yes
checking for pkg-config... /usr/bin/pkg-config
checking pkg-config is at least version 0.9.0... yes
checking for libupnp version >= 1.6.6... no (try to use --with-libupnp-prefix=PREFIX)
configure: WARNING:
UPnP code has been disabled because libupnp >= 1.6.6 not found (try to use --with-libupnp-prefix=PREFIX).
checking for crypto++ version >= 5.1... yes (version 5.6.1, installed)
checking whether the C++ compiler (g++) uses strict aliasing... no
checking that wxWidgets has support for large files... yes
checking for exception-handling... yes
checking typeinfo usability... yes
checking typeinfo presence... yes
checking for typeinfo... yes
checking for and __cxa_demangle()... yes
checking for size_t... yes
checking for working alloca.h... yes
checking for alloca... yes
checking for dirent.h that defines DIR... yes
checking for library containing opendir... none required
checking for ANSI C header files... (cached) yes
checking argz.h usability... yes
checking argz.h presence... yes
checking for argz.h... yes
checking arpa/inet.h usability... yes
checking arpa/inet.h presence... yes
checking for arpa/inet.h... yes
checking fcntl.h usability... yes
checking fcntl.h presence... yes
checking for fcntl.h... yes
checking for inttypes.h... (cached) yes
checking langinfo.h usability... yes
checking langinfo.h presence... yes
checking for langinfo.h... yes
checking libintl.h usability... yes
checking libintl.h presence... yes
checking for libintl.h... yes
checking limits.h usability... yes
checking limits.h presence... yes
checking for limits.h... yes
checking locale.h usability... yes
checking locale.h presence... yes
checking for locale.h... yes
checking malloc.h usability... yes
checking malloc.h presence... yes
checking for malloc.h... yes
checking mntent.h usability... yes
checking mntent.h presence... yes
checking for mntent.h... yes
checking netdb.h usability... yes
checking netdb.h presence... yes
checking for netdb.h... yes
checking netinet/in.h usability... yes
checking netinet/in.h presence... yes
checking for netinet/in.h... yes
checking stddef.h usability... yes
checking stddef.h presence... yes
checking for stddef.h... yes
checking nl_types.h usability... yes
checking nl_types.h presence... yes
checking for nl_types.h... yes
checking for stdint.h... (cached) yes
checking stdio_ext.h usability... yes
checking stdio_ext.h presence... yes
checking for stdio_ext.h... yes
checking for stdlib.h... (cached) yes
checking for string.h... (cached) yes
checking for strings.h... (cached) yes
checking sys/ioctl.h usability... yes
checking sys/ioctl.h presence... yes
checking for sys/ioctl.h... yes
checking sys/mntent.h usability... no
checking sys/mntent.h presence... no
checking for sys/mntent.h... no
checking sys/mnttab.h usability... no
checking sys/mnttab.h presence... no
checking for sys/mnttab.h... no
checking sys/mount.h usability... yes
checking sys/mount.h presence... yes
checking for sys/mount.h... yes
checking sys/param.h usability... yes
checking sys/param.h presence... yes
checking for sys/param.h... yes
checking sys/resource.h usability... yes
checking sys/resource.h presence... yes
checking for sys/resource.h... yes
checking sys/select.h usability... yes
checking sys/select.h presence... yes
checking for sys/select.h... yes
checking sys/socket.h usability... yes
checking sys/socket.h presence... yes
checking for sys/socket.h... yes
checking sys/statvfs.h usability... yes
checking sys/statvfs.h presence... yes
checking for sys/statvfs.h... yes
checking sys/time.h usability... yes
checking sys/time.h presence... yes
checking for sys/time.h... yes
checking sys/timeb.h usability... yes
checking sys/timeb.h presence... yes
checking for sys/timeb.h... yes
checking for sys/types.h... (cached) yes
checking for unistd.h... (cached) yes
checking errno.h usability... yes
checking errno.h presence... yes
checking for errno.h... yes
checking signal.h usability... yes
checking signal.h presence... yes
checking for signal.h... yes
checking for sys/wait.h that is POSIX.1 compatible... yes
checking for stdbool.h that conforms to C99... yes
checking for _Bool... yes
checking for an ANSI C-conforming const... yes
checking for inline... inline
checking for mode_t... yes
checking for off_t... yes
checking for size_t... (cached) yes
checking whether time.h and sys/time.h may both be included... yes
checking whether struct tm is in sys/time.h or time.h... time.h
checking for uid_t in sys/types.h... yes
checking for working volatile... yes
checking for ptrdiff_t... yes
checking whether closedir returns void... no
checking whether gcc needs -traditional... no
checking for pid_t... yes
checking vfork.h usability... no
checking vfork.h presence... no
checking for vfork.h... no
checking for fork... yes
checking for vfork... yes
checking for working fork... yes
checking for working vfork... (cached) yes
checking whether lstat correctly handles trailing slash... yes
checking for library containing getmntent... none required
checking whether lstat accepts an empty string... no
checking whether lstat correctly handles trailing slash... (cached) yes
checking for working memcmp... yes
checking for sys/select.h... (cached) yes
checking for sys/socket.h... (cached) yes
checking types of arguments for select... int,fd_set *,struct timeval *
checking return type of signal handlers... void
checking whether stat accepts an empty string... no
checking for strftime... yes
checking for working strtod... yes
checking for vprintf... yes
checking for _doprnt... no
checking for stdlib.h... (cached) yes
checking for GNU libc compatible malloc... yes
checking for stdlib.h... (cached) yes
checking for GNU libc compatible realloc... yes
checking for __argz_count... yes
checking for __argz_next... yes
checking for __argz_stringify... yes
checking for endpwent... yes
checking for floor... no
checking for ftruncate... yes
checking for getcwd... yes
checking for gethostbyaddr... yes
checking for gethostbyname... yes
checking for gethostname... yes
checking for getpass... yes
checking for gettimeofday... yes
checking for inet_ntoa... yes
checking for localeconv... yes
checking for memmove... yes
checking for mempcpy... yes
checking for memset... yes
checking for nl_langinfo... yes
checking for pow... no
checking for select... yes
checking for setlocale... yes
checking for socket... yes
checking for sqrt... no
checking for stpcpy... yes
checking for strcasecmp... yes
checking for strchr... yes
checking for strcspn... yes
checking for strdup... yes
checking for strerror... yes
checking for strncasecmp... yes
checking for strstr... yes
checking for strtoul... yes
checking for sigaction... yes
checking for mkdir... yes
checking for getrlimit... yes
checking for setrlimit... yes
checking for getopt_long... yes
checking for stdlib.h... (cached) yes
checking for unistd.h... (cached) yes
checking for sys/param.h... (cached) yes
checking whether strerror_r is declared... yes
checking for strerror_r... yes
checking whether strerror_r returns char *... no
checking for fallocate... yes
checking for SYS_fallocate... yes
checking for posix_fallocate... yes
checking for msgfmt... /usr/bin/msgfmt
checking for gmsgfmt... /usr/bin/msgfmt
checking for xgettext... /usr/bin/xgettext
checking for msgmerge... /usr/bin/msgmerge
checking for strerror in -lcposix... no
checking whether we are using the GNU C Library 2.1 or newer... yes
checking whether integer division by zero raises SIGFPE... yes
checking for inttypes.h... yes
checking for stdint.h... yes
checking for unsigned long long... yes
checking for inttypes.h... yes
checking whether the inttypes.h PRIxNN macros are broken... no
checking for ld used by GCC... ld
checking if the linker (ld) is GNU ld... yes
checking for shared library run path origin... done
checking for argz.h... (cached) yes
checking for limits.h... (cached) yes
checking for locale.h... (cached) yes
checking for nl_types.h... (cached) yes
checking for malloc.h... (cached) yes
checking for stddef.h... (cached) yes
checking for stdlib.h... (cached) yes
checking for string.h... (cached) yes
checking for unistd.h... (cached) yes
checking for sys/param.h... (cached) yes
checking for feof_unlocked... yes
checking for fgets_unlocked... yes
checking for getc_unlocked... yes
checking for getcwd... (cached) yes
checking for getegid... yes
checking for geteuid... yes
checking for getgid... yes
checking for getuid... yes
checking for mempcpy... (cached) yes
checking for munmap... (cached) no
checking for putenv... yes
checking for setenv... yes
checking for setlocale... (cached) yes
checking for stpcpy... (cached) yes
checking for strcasecmp... (cached) yes
checking for strdup... (cached) yes
checking for strtoul... (cached) yes
checking for tsearch... yes
checking for __argz_count... (cached) yes
checking for __argz_stringify... (cached) yes
checking for __argz_next... (cached) yes
checking for iconv... yes
checking for iconv declaration...
extern size_t iconv (iconv_t cd, char * *inbuf, size_t *inbytesleft, char * *outbuf, size_t *outbytesleft);
checking for nl_langinfo and CODESET... yes
checking for LC_MESSAGES... yes
checking for bison... no
checking whether NLS is requested... yes
checking whether included gettext is requested... no
checking for GNU gettext in libc... yes
checking for autopoint... yes (0.18.3)
checking for requested languages... all
checking for bfd... no
configure: WARNING:
bfd.h not found or unusable, please install binutils development
package if you are a developer or want to help testing aMule
checking for and backtrace()... yes
checking for docdir... ${datarootdir}/doc/${PACKAGE_TARNAME}
checking for SVNDATE... rev. 10835
checking denoising level... 0
checking for a readline compatible library... no
checking whether ccache support should be added... no
checking that generated files are newer than configure... done
configure: creating ./config.status
config.status: creating Makefile
config.status: creating docs/Makefile
config.status: creating docs/man/Makefile
config.status: creating intl/Makefile
config.status: creating src/Makefile
config.status: creating src/pixmaps/Makefile
config.status: creating src/pixmaps/flags_xpm/Makefile
config.status: creating src/libs/Makefile
config.status: creating src/libs/ec/Makefile
config.status: creating src/libs/ec/cpp/Makefile
config.status: creating src/libs/common/Makefile
config.status: creating src/utils/Makefile
config.status: creating src/utils/aLinkCreator/Makefile
config.status: creating src/utils/aLinkCreator/docs/Makefile
config.status: creating src/utils/aLinkCreator/src/Makefile
config.status: creating src/utils/cas/Makefile
config.status: creating src/utils/cas/docs/Makefile
config.status: creating src/utils/fileview/Makefile
config.status: creating src/utils/plasmamule/Makefile
config.status: creating src/utils/wxCas/Makefile
config.status: creating src/utils/wxCas/docs/Makefile
config.status: creating src/utils/wxCas/src/Makefile
config.status: creating src/utils/xas/Makefile
config.status: creating src/utils/xas/autostart-xas
config.status: creating src/utils/xas/docs/Makefile
config.status: creating src/skins/Makefile
config.status: creating src/webserver/Makefile
config.status: creating src/webserver/src/Makefile
config.status: creating src/webserver/default/Makefile
config.status: creating unittests/Makefile
config.status: creating unittests/muleunit/Makefile
config.status: creating unittests/tests/Makefile
config.status: creating po/Makefile.in
config.status: creating Compilation.flags
config.status: creating config.h
config.status: config.h is unchanged
config.status: executing depfiles commands
config.status: executing default-1 commands
config.status: creating po/POTFILES
config.status: creating po/Makefile
config.status: executing denoiser commands


Configure script has finished system check.

Configured aMule SVN (rev. 10835) for 'x86_64-unknown-linux-gnu'.

aMule enabled options:

**** aMule Core ****
Prefix where aMule should be installed? /usr/local
Should aMule be compiled with i18n support? yes
Should aMule be compiled in debug mode? yes
Should aMule be compiled with profiling? no
Should aMule be compiled with optimizations? no
Should aMule be compiled with UPnP support? disabled
Should aMule be compiled with IP2country support? no
Should aMule monolithic application be built? no
Should aMule daemon version be built? yes
Should aMule remote gui be built? no
Crypto++ library/headers style? installed

**** aMule TextClient ****
Should aMule Command Line Client be built? yes

**** aMule WebServer ****
Should aMule WebServer be built? yes

**** aMule ED2K Links Handler ****
Should aMule ED2K Links Handler be built? yes

**** aMuleLinkCreator ****
Should aMuleLinkCreator GUI version (alc) be built? no
Should aMuleLinkCreator for console (alcc) be built? no

**** aMule Statistics ****
Should C aMule Statistics (CAS) be built? no
Should aMule GUI Statistics (wxCas) be built? no
Should xas XChat2 plugin be installed? no
Should plasmaMule plasma-applet be build? no

**** General Libraries and Tools ****
Should ccache support be enabled? no
Libraries aMule will use to build:
wxWidgets 2.8.12 (base,debug,static)
crypto++ 5.6.1 (installed, in /usr)
libintl system
libpng 1.2.50
zlib 1.2.8


*** Warnings during configuration ***

* UPnP code has been disabled because libupnp >= 1.6.6 not found (try to use --with-libupnp-prefix=PREFIX).

* bfd.h not found or unusable, please install binutils development package if
you are a developer or want to help testing aMule[/code]

So, the problem is now when I set MAKE command, the output is:

[code]hp@srv-01:~/amule/amule-read-only$ sudo make
make all-recursive
make[1]: se ingresa al directorio «/home/hp/amule/amule-read-only»
Making all in intl
make[2]: se ingresa al directorio «/home/hp/amule/amule-read-only/intl»
make[2]: No se hace nada para «all».
make[2]: se sale del directorio «/home/hp/amule/amule-read-only/intl»
Making all in po
make[2]: se ingresa al directorio «/home/hp/amule/amule-read-only/po»
make[2]: No se hace nada para «all».
make[2]: se sale del directorio «/home/hp/amule/amule-read-only/po»
Making all in docs
make[2]: se ingresa al directorio «/home/hp/amule/amule-read-only/docs»
Making all in man
make[3]: se ingresa al directorio «/home/hp/amule/amule-read-only/docs/man»
make[3]: No se hace nada para «all».
make[3]: se sale del directorio «/home/hp/amule/amule-read-only/docs/man»
make[3]: se ingresa al directorio «/home/hp/amule/amule-read-only/docs»
make[3]: No se hace nada para «all-am».
make[3]: se sale del directorio «/home/hp/amule/amule-read-only/docs»
make[2]: se sale del directorio «/home/hp/amule/amule-read-only/docs»
Making all in src
make[2]: se ingresa al directorio «/home/hp/amule/amule-read-only/src»
Making all in libs
make[3]: se ingresa al directorio «/home/hp/amule/amule-read-only/src/libs»
Making all in common
make[4]: se ingresa al directorio «/home/hp/amule/amule-read-only/src/libs/common»
make[4]: No se hace nada para «all».
make[4]: se sale del directorio «/home/hp/amule/amule-read-only/src/libs/common»
Making all in ec
make[4]: se ingresa al directorio «/home/hp/amule/amule-read-only/src/libs/ec»
make all-recursive
make[5]: se ingresa al directorio «/home/hp/amule/amule-read-only/src/libs/ec»
Making all in cpp
make[6]: se ingresa al directorio «/home/hp/amule/amule-read-only/src/libs/ec/cpp»
make all-am
make[7]: se ingresa al directorio «/home/hp/amule/amule-read-only/src/libs/ec/cpp»
make[7]: No se hace nada para «all-am».
make[7]: se sale del directorio «/home/hp/amule/amule-read-only/src/libs/ec/cpp»
make[6]: se sale del directorio «/home/hp/amule/amule-read-only/src/libs/ec/cpp»
make[6]: se ingresa al directorio «/home/hp/amule/amule-read-only/src/libs/ec»
make[6]: No se hace nada para «all-am».
make[6]: se sale del directorio «/home/hp/amule/amule-read-only/src/libs/ec»
make[5]: se sale del directorio «/home/hp/amule/amule-read-only/src/libs/ec»
make[4]: se sale del directorio «/home/hp/amule/amule-read-only/src/libs/ec»
make[4]: se ingresa al directorio «/home/hp/amule/amule-read-only/src/libs»
make[4]: No se hace nada para «all-am».
make[4]: se sale del directorio «/home/hp/amule/amule-read-only/src/libs»
make[3]: se sale del directorio «/home/hp/amule/amule-read-only/src/libs»
Making all in utils
make[3]: se ingresa al directorio «/home/hp/amule/amule-read-only/src/utils»
make[4]: se ingresa al directorio «/home/hp/amule/amule-read-only/src/utils»
make[4]: No se hace nada para «all-am».
make[4]: se sale del directorio «/home/hp/amule/amule-read-only/src/utils»
make[3]: se sale del directorio «/home/hp/amule/amule-read-only/src/utils»
Making all in pixmaps
make[3]: se ingresa al directorio «/home/hp/amule/amule-read-only/src/pixmaps»
Making all in flags_xpm
make[4]: se ingresa al directorio «/home/hp/amule/amule-read-only/src/pixmaps/flags_xpm»
make[4]: No se hace nada para «all».
make[4]: se sale del directorio «/home/hp/amule/amule-read-only/src/pixmaps/flags_xpm»
make[4]: se ingresa al directorio «/home/hp/amule/amule-read-only/src/pixmaps»
make[4]: No se hace nada para «all-am».
make[4]: se sale del directorio «/home/hp/amule/amule-read-only/src/pixmaps»
make[3]: se sale del directorio «/home/hp/amule/amule-read-only/src/pixmaps»
Making all in .
make[3]: se ingresa al directorio «/home/hp/amule/amule-read-only/src»
: -Pyyip -o IPFilterScanner.cpp ./IPFilterScanner.l;
: -o Scanner.cpp ./Scanner.l; \
echo "// Empty file generated by a flex version unable to create headers" > ./Scanner.h
g++ -DHAVE_CONFIG_H -I. -I.. -D__DEBUG__ -DUSE_WX_EXTENSIONS -I/usr/local/lib/wx/include/base-unicode-debug-static-2.8 -I/usr/local/include/wx-2.8 -D_FILE_OFFSET_BITS=64 -D_LARGE_FILES -D__WXDEBUG__ -DwxUSE_GUI=0 -DwxUSE_GUI=0 -I./libs -I./include -I/usr/include -D__WEAK_CRYPTO__ -g -W -Wall -Wshadow -Wundef -ggdb -fno-inline -fmessage-length=0 -MT libmuleappcore_a-Parser.o -MD -MP -MF .deps/libmuleappcore_a-Parser.Tpo -c -o libmuleappcore_a-Parser.o `test -f 'Parser.cpp' || echo './'`Parser.cpp
In file included from /usr/local/include/wx-2.8/wx/defs.h:521:0,
from /usr/local/include/wx-2.8/wx/arrstr.h:15,
from SearchExpr.h:29,
from ./Parser.y:2:
/usr/local/include/wx-2.8/wx/buffer.h: In member function ‘void wxMemoryBuffer::AppendByte(char)’:
/usr/local/include/wx-2.8/wx/debug.h:194:43: warning: typedef ‘wxDummyCheckInt’ locally defined but not used [-Wunused-local-typedefs]
#define wxFORCE_SEMICOLON typedef int wxDummyCheckInt
^
/usr/local/include/wx-2.8/wx/debug.h:224:9: note: in expansion of macro ‘wxFORCE_SEMICOLON’
wxFORCE_SEMICOLON /* just to force a semicolon */
^
/usr/local/include/wx-2.8/wx/debug.h:233:38: note: in expansion of macro ‘wxCHECK2_MSG’
#define wxCHECK_RET(cond, msg) wxCHECK2_MSG(cond, return, msg)
^
/usr/local/include/wx-2.8/wx/buffer.h:289:9: note: in expansion of macro ‘wxCHECK_RET’
wxCHECK_RET( m_bufdata->m_data, wxT("invalid wxMemoryBuffer") );
^
kademlia/utils/UInt128.h: In member function ‘Kademlia::CUInt128& Kademlia::CUInt128::SetBitNumber(unsigned int, unsigned int)’:
/usr/local/include/wx-2.8/wx/debug.h:194:43: warning: typedef ‘wxDummyCheckInt’ locally defined but not used [-Wunused-local-typedefs]
#define wxFORCE_SEMICOLON typedef int wxDummyCheckInt
^
/usr/local/include/wx-2.8/wx/debug.h:224:9: note: in expansion of macro ‘wxFORCE_SEMICOLON’
wxFORCE_SEMICOLON /* just to force a semicolon */
^
/usr/local/include/wx-2.8/wx/debug.h:186:38: note: in expansion of macro ‘wxCHECK2_MSG’
#define wxCHECK_MSG(cond, rc, msg) wxCHECK2_MSG(cond, return rc, msg)
^
/usr/local/include/wx-2.8/wx/debug.h:183:38: note: in expansion of macro ‘wxCHECK_MSG’
#define wxCHECK(cond, rc) wxCHECK_MSG(cond, rc, NULL)
^
kademlia/utils/UInt128.h:98:3: note: in expansion of macro ‘wxCHECK’
wxCHECK(bit <= 127, *this);
^
kademlia/utils/UInt128.h: In member function ‘void Kademlia::CUInt128::Set32BitChunk(unsigned int, uint32_t)’:
/usr/local/include/wx-2.8/wx/debug.h:194:43: warning: typedef ‘wxDummyCheckInt’ locally defined but not used [-Wunused-local-typedefs]
#define wxFORCE_SEMICOLON typedef int wxDummyCheckInt
^
/usr/local/include/wx-2.8/wx/debug.h:224:9: note: in expansion of macro ‘wxFORCE_SEMICOLON’
wxFORCE_SEMICOLON /* just to force a semicolon */
^
/usr/local/include/wx-2.8/wx/debug.h:189:38: note: in expansion of macro ‘wxCHECK2_MSG’
#define wxCHECK2(cond, op) wxCHECK2_MSG(cond, op, NULL)
^
kademlia/utils/UInt128.h:117:3: note: in expansion of macro ‘wxCHECK2’
wxCHECK2(chunk < 4, return);
^
/usr/local/include/wx-2.8/wx/dynarray.h: In member function ‘void wxArrayShort::Remove(_wxArraywxArrayShort)’:
/usr/local/include/wx-2.8/wx/debug.h:194:43: warning: typedef ‘wxDummyCheckInt’ locally defined but not used [-Wunused-local-typedefs]
#define wxFORCE_SEMICOLON typedef int wxDummyCheckInt
^
/usr/local/include/wx-2.8/wx/debug.h:224:9: note: in expansion of macro ‘wxFORCE_SEMICOLON’
wxFORCE_SEMICOLON /* just to force a semicolon */
^
/usr/local/include/wx-2.8/wx/dynarray.h:353:7: note: in expansion of macro ‘wxCHECK2_MSG’
wxCHECK2_MSG( iIndex != wxNOT_FOUND, return, \
^
/usr/local/include/wx-2.8/wx/dynarray.h:486:5: note: in expansion of macro ‘_WX_DEFINE_TYPEARRAY_HELPER’
_WX_DEFINE_TYPEARRAY_HELPER(T, name, base, classexp, _WX_PTROP_NONE)
^
/usr/local/include/wx-2.8/wx/dynarray.h:669:5: note: in expansion of macro ‘_WX_DEFINE_TYPEARRAY_PTR’
_WX_DEFINE_TYPEARRAY_PTR(_wxArray##name, name, base, classdecl)
^
/usr/local/include/wx-2.8/wx/dynarray.h:849:5: note: in expansion of macro ‘WX_DEFINE_TYPEARRAY_WITH_DECL_PTR’
WX_DEFINE_TYPEARRAY_WITH_DECL_PTR(T, name, wxBaseArrayShort, wxARRAY_EMPTY expmode)
^
/usr/local/include/wx-2.8/wx/dynarray.h:993:1: note: in expansion of macro ‘WX_DEFINE_USER_EXPORTED_ARRAY_SHORT’
WX_DEFINE_USER_EXPORTED_ARRAY_SHORT(short, wxArrayShort, class WXDLLIMPEXP_BASE);
^
/usr/local/include/wx-2.8/wx/dynarray.h: In member function ‘void wxArrayInt::Remove(_wxArraywxArrayInt)’:
/usr/local/include/wx-2.8/wx/debug.h:194:43: warning: typedef ‘wxDummyCheckInt’ locally defined but not used [-Wunused-local-typedefs]
#define wxFORCE_SEMICOLON typedef int wxDummyCheckInt
^
/usr/local/include/wx-2.8/wx/debug.h:224:9: note: in expansion of macro ‘wxFORCE_SEMICOLON’
wxFORCE_SEMICOLON /* just to force a semicolon */
^
/usr/local/include/wx-2.8/wx/dynarray.h:353:7: note: in expansion of macro ‘wxCHECK2_MSG’
wxCHECK2_MSG( iIndex != wxNOT_FOUND, return, \
^
/usr/local/include/wx-2.8/wx/dynarray.h:486:5: note: in expansion of macro ‘_WX_DEFINE_TYPEARRAY_HELPER’
_WX_DEFINE_TYPEARRAY_HELPER(T, name, base, classexp, _WX_PTROP_NONE)
^
/usr/local/include/wx-2.8/wx/dynarray.h:669:5: note: in expansion of macro ‘_WX_DEFINE_TYPEARRAY_PTR’
_WX_DEFINE_TYPEARRAY_PTR(_wxArray##name, name, base, classdecl)
^
/usr/local/include/wx-2.8/wx/dynarray.h:856:5: note: in expansion of macro ‘WX_DEFINE_TYPEARRAY_WITH_DECL_PTR’
WX_DEFINE_TYPEARRAY_WITH_DECL_PTR(T, name, wxBaseArrayInt, wxARRAY_EMPTY expmode)
^
/usr/local/include/wx-2.8/wx/dynarray.h:994:1: note: in expansion of macro ‘WX_DEFINE_USER_EXPORTED_ARRAY_INT’
WX_DEFINE_USER_EXPORTED_ARRAY_INT(int, wxArrayInt, class WXDLLIMPEXP_BASE);
^
/usr/local/include/wx-2.8/wx/dynarray.h: In member function ‘void wxArrayDouble::Remove(_wxArraywxArrayDouble)’:
/usr/local/include/wx-2.8/wx/debug.h:194:43: warning: typedef ‘wxDummyCheckInt’ locally defined but not used [-Wunused-local-typedefs]
#define wxFORCE_SEMICOLON typedef int wxDummyCheckInt
^
/usr/local/include/wx-2.8/wx/debug.h:224:9: note: in expansion of macro ‘wxFORCE_SEMICOLON’
wxFORCE_SEMICOLON /* just to force a semicolon */
^
/usr/local/include/wx-2.8/wx/dynarray.h:353:7: note: in expansion of macro ‘wxCHECK2_MSG’
wxCHECK2_MSG( iIndex != wxNOT_FOUND, return, \
^
/usr/local/include/wx-2.8/wx/dynarray.h:486:5: note: in expansion of macro ‘_WX_DEFINE_TYPEARRAY_HELPER’
_WX_DEFINE_TYPEARRAY_HELPER(T, name, base, classexp, _WX_PTROP_NONE)
^
/usr/local/include/wx-2.8/wx/dynarray.h:669:5: note: in expansion of macro ‘_WX_DEFINE_TYPEARRAY_PTR’
_WX_DEFINE_TYPEARRAY_PTR(_wxArray##name, name, base, classdecl)
^
/usr/local/include/wx-2.8/wx/dynarray.h:877:5: note: in expansion of macro ‘WX_DEFINE_TYPEARRAY_WITH_DECL_PTR’
WX_DEFINE_TYPEARRAY_WITH_DECL_PTR(T, name, wxBaseArrayDouble, wxARRAY_EMPTY expmode)
^
/usr/local/include/wx-2.8/wx/dynarray.h:995:1: note: in expansion of macro ‘WX_DEFINE_USER_EXPORTED_ARRAY_DOUBLE’
WX_DEFINE_USER_EXPORTED_ARRAY_DOUBLE(double, wxArrayDouble, class WXDLLIMPEXP_BASE);
^
/usr/local/include/wx-2.8/wx/dynarray.h: In member function ‘void wxArrayLong::Remove(_wxArraywxArrayLong)’:
/usr/local/include/wx-2.8/wx/debug.h:194:43: warning: typedef ‘wxDummyCheckInt’ locally defined but not used [-Wunused-local-typedefs]
#define wxFORCE_SEMICOLON typedef int wxDummyCheckInt
^
/usr/local/include/wx-2.8/wx/debug.h:224:9: note: in expansion of macro ‘wxFORCE_SEMICOLON’
wxFORCE_SEMICOLON /* just to force a semicolon */
^
/usr/local/include/wx-2.8/wx/dynarray.h:353:7: note: in expansion of macro ‘wxCHECK2_MSG’
wxCHECK2_MSG( iIndex != wxNOT_FOUND, return, \
^
/usr/local/include/wx-2.8/wx/dynarray.h:486:5: note: in expansion of macro ‘_WX_DEFINE_TYPEARRAY_HELPER’
_WX_DEFINE_TYPEARRAY_HELPER(T, name, base, classexp, _WX_PTROP_NONE)
^
/usr/local/include/wx-2.8/wx/dynarray.h:669:5: note: in expansion of macro ‘_WX_DEFINE_TYPEARRAY_PTR’
_WX_DEFINE_TYPEARRAY_PTR(_wxArray##name, name, base, classdecl)
^
/usr/local/include/wx-2.8/wx/dynarray.h:863:5: note: in expansion of macro ‘WX_DEFINE_TYPEARRAY_WITH_DECL_PTR’
WX_DEFINE_TYPEARRAY_WITH_DECL_PTR(T, name, wxBaseArrayLong, wxARRAY_EMPTY expmode)
^
/usr/local/include/wx-2.8/wx/dynarray.h:996:1: note: in expansion of macro ‘WX_DEFINE_USER_EXPORTED_ARRAY_LONG’
WX_DEFINE_USER_EXPORTED_ARRAY_LONG(long, wxArrayLong, class WXDLLIMPEXP_BASE);
^
/usr/local/include/wx-2.8/wx/dynarray.h: In member function ‘void wxArrayPtrVoid::Remove(_wxArraywxArrayPtrVoid)’:
/usr/local/include/wx-2.8/wx/debug.h:194:43: warning: typedef ‘wxDummyCheckInt’ locally defined but not used [-Wunused-local-typedefs]
#define wxFORCE_SEMICOLON typedef int wxDummyCheckInt
^
/usr/local/include/wx-2.8/wx/debug.h:224:9: note: in expansion of macro ‘wxFORCE_SEMICOLON’
wxFORCE_SEMICOLON /* just to force a semicolon */
^
/usr/local/include/wx-2.8/wx/dynarray.h:353:7: note: in expansion of macro ‘wxCHECK2_MSG’
wxCHECK2_MSG( iIndex != wxNOT_FOUND, return, \
^
/usr/local/include/wx-2.8/wx/dynarray.h:486:5: note: in expansion of macro ‘_WX_DEFINE_TYPEARRAY_HELPER’
_WX_DEFINE_TYPEARRAY_HELPER(T, name, base, classexp, _WX_PTROP_NONE)
^
/usr/local/include/wx-2.8/wx/dynarray.h:669:5: note: in expansion of macro ‘_WX_DEFINE_TYPEARRAY_PTR’
_WX_DEFINE_TYPEARRAY_PTR(_wxArray##name, name, base, classdecl)
^
/usr/local/include/wx-2.8/wx/dynarray.h:835:5: note: in expansion of macro ‘WX_DEFINE_TYPEARRAY_WITH_DECL_PTR’
WX_DEFINE_TYPEARRAY_WITH_DECL_PTR(T, name, wxBaseArrayPtrVoid, wxARRAY_EMPTY expmode)
^
/usr/local/include/wx-2.8/wx/dynarray.h:997:1: note: in expansion of macro ‘WX_DEFINE_USER_EXPORTED_ARRAY_PTR’
WX_DEFINE_USER_EXPORTED_ARRAY_PTR(void *, wxArrayPtrVoid, class WXDLLIMPEXP_BASE);
^
/usr/local/include/wx-2.8/wx/vector.h: In member function ‘wxVectorBase& wxVectorBase:perator=(const wxVectorBase&)’:
/usr/local/include/wx-2.8/wx/debug.h:194:43: warning: typedef ‘wxDummyCheckInt’ locally defined but not used [-Wunused-local-typedefs]
#define wxFORCE_SEMICOLON typedef int wxDummyCheckInt
^
/usr/local/include/wx-2.8/wx/debug.h:224:9: note: in expansion of macro ‘wxFORCE_SEMICOLON’
wxFORCE_SEMICOLON /* just to force a semicolon */
^
/usr/local/include/wx-2.8/wx/debug.h:186:38: note: in expansion of macro ‘wxCHECK2_MSG’
#define wxCHECK_MSG(cond, rc, msg) wxCHECK2_MSG(cond, return rc, msg)
^
/usr/local/include/wx-2.8/wx/debug.h:183:38: note: in expansion of macro ‘wxCHECK_MSG’
#define wxCHECK(cond, rc) wxCHECK_MSG(cond, rc, NULL)
^
/usr/local/include/wx-2.8/wx/vector.h:129:9: note: in expansion of macro ‘wxCHECK’
wxCHECK(copy(vb), *this);
^
/usr/local/include/wx-2.8/wx/clntdata.h: In copy constructor ‘wxClientDataDictionaryPairVector::wxClientDataDictionaryPairVector(const wxClientDataDictionaryPairVector&)’:
/usr/local/include/wx-2.8/wx/debug.h:194:43: warning: typedef ‘wxDummyCheckInt’ locally defined but not used [-Wunused-local-typedefs]
#define wxFORCE_SEMICOLON typedef int wxDummyCheckInt
^
/usr/local/include/wx-2.8/wx/debug.h:224:9: note: in expansion of macro ‘wxFORCE_SEMICOLON’
wxFORCE_SEMICOLON /* just to force a semicolon */
^
/usr/local/include/wx-2.8/wx/debug.h:189:38: note: in expansion of macro ‘wxCHECK2_MSG’
#define wxCHECK2(cond, op) wxCHECK2_MSG(cond, op, NULL)
^
/usr/local/include/wx-2.8/wx/vector.h:148:9: note: in expansion of macro ‘wxCHECK2’
wxCHECK2(copy(c), return);\
^
/usr/local/include/wx-2.8/wx/vector.h:158:5: note: in expansion of macro ‘WX_DECLARE_VECTORBASE’
WX_DECLARE_VECTORBASE(obj, cls)\
^
/usr/local/include/wx-2.8/wx/clntdata.h:172:1: note: in expansion of macro ‘_WX_DECLARE_VECTOR’
_WX_DECLARE_VECTOR(
^
/usr/local/include/wx-2.8/wx/clntdata.h: In member function ‘void wxClientDataDictionaryPairVector::push_back(const wxClientDataDictionaryPair&)’:
/usr/local/include/wx-2.8/wx/debug.h:194:43: warning: typedef ‘wxDummyCheckInt’ locally defined but not used [-Wunused-local-typedefs]
#define wxFORCE_SEMICOLON typedef int wxDummyCheckInt
^
/usr/local/include/wx-2.8/wx/debug.h:224:9: note: in expansion of macro ‘wxFORCE_SEMICOLON’
wxFORCE_SEMICOLON /* just to force a semicolon */
^
/usr/local/include/wx-2.8/wx/debug.h:189:38: note: in expansion of macro ‘wxCHECK2_MSG’
#define wxCHECK2(cond, op) wxCHECK2_MSG(cond, op, NULL)
^
/usr/local/include/wx-2.8/wx/vector.h:162:9: note: in expansion of macro ‘wxCHECK2’
wxCHECK2(Alloc(size() + 1), return);\
^
/usr/local/include/wx-2.8/wx/clntdata.h:172:1: note: in expansion of macro ‘_WX_DECLARE_VECTOR’
_WX_DECLARE_VECTOR(
^
/usr/local/include/wx-2.8/wx/event.h: In member function ‘void wxEventTableEntryPointerArray::Remove(_wxArraywxEventTableEntryPointerArray)’:
/usr/local/include/wx-2.8/wx/debug.h:194:43: warning: typedef ‘wxDummyCheckInt’ locally defined but not used [-Wunused-local-typedefs]
#define wxFORCE_SEMICOLON typedef int wxDummyCheckInt
^
/usr/local/include/wx-2.8/wx/debug.h:224:9: note: in expansion of macro ‘wxFORCE_SEMICOLON’
wxFORCE_SEMICOLON /* just to force a semicolon */
^
/usr/local/include/wx-2.8/wx/dynarray.h:353:7: note: in expansion of macro ‘wxCHECK2_MSG’
wxCHECK2_MSG( iIndex != wxNOT_FOUND, return, \
^
/usr/local/include/wx-2.8/wx/dynarray.h:486:5: note: in expansion of macro ‘_WX_DEFINE_TYPEARRAY_HELPER’
_WX_DEFINE_TYPEARRAY_HELPER(T, name, base, classexp, _WX_PTROP_NONE)
^
/usr/local/include/wx-2.8/wx/dynarray.h:669:5: note: in expansion of macro ‘_WX_DEFINE_TYPEARRAY_PTR’
_WX_DEFINE_TYPEARRAY_PTR(_wxArray##name, name, base, classdecl)
^
/usr/local/include/wx-2.8/wx/dynarray.h:649:5: note: in expansion of macro ‘WX_DEFINE_TYPEARRAY_WITH_DECL_PTR’
WX_DEFINE_TYPEARRAY_WITH_DECL_PTR(T, name, base, class wxARRAY_DEFAULT_EXPORT)
^
/usr/local/include/wx-2.8/wx/dynarray.h:825:5: note: in expansion of macro ‘WX_DEFINE_TYPEARRAY_PTR’
WX_DEFINE_TYPEARRAY_PTR(T, name, wxBaseArrayPtrVoid)
^
/usr/local/include/wx-2.8/wx/event.h:2324:1: note: in expansion of macro ‘WX_DEFINE_ARRAY_PTR’
WX_DEFINE_ARRAY_PTR(const wxEventTableEntry*, wxEventTableEntryPointerArray);
^
/usr/local/include/wx-2.8/wx/event.h: In function ‘void wxPostEvent(wxEvtHandler*, wxEvent&)’:
/usr/local/include/wx-2.8/wx/debug.h:194:43: warning: typedef ‘wxDummyCheckInt’ locally defined but not used [-Wunused-local-typedefs]
#define wxFORCE_SEMICOLON typedef int wxDummyCheckInt
^
/usr/local/include/wx-2.8/wx/debug.h:224:9: note: in expansion of macro ‘wxFORCE_SEMICOLON’
wxFORCE_SEMICOLON /* just to force a semicolon */
^
/usr/local/include/wx-2.8/wx/debug.h:233:38: note: in expansion of macro ‘wxCHECK2_MSG’
#define wxCHECK_RET(cond, msg) wxCHECK2_MSG(cond, return, msg)
^
/usr/local/include/wx-2.8/wx/event.h:2568:5: note: in expansion of macro ‘wxCHECK_RET’
wxCHECK_RET( dest, wxT("need an object to post event to in wxPostEvent") );
^
/usr/local/include/wx-2.8/wx/module.h: In member function ‘void wxArrayClassInfo::Remove(_wxArraywxArrayClassInfo)’:
/usr/local/include/wx-2.8/wx/debug.h:194:43: warning: typedef ‘wxDummyCheckInt’ locally defined but not used [-Wunused-local-typedefs]
#define wxFORCE_SEMICOLON typedef int wxDummyCheckInt
^
/usr/local/include/wx-2.8/wx/debug.h:224:9: note: in expansion of macro ‘wxFORCE_SEMICOLON’
wxFORCE_SEMICOLON /* just to force a semicolon */
^
/usr/local/include/wx-2.8/wx/dynarray.h:353:7: note: in expansion of macro ‘wxCHECK2_MSG’
wxCHECK2_MSG( iIndex != wxNOT_FOUND, return, \
^
/usr/local/include/wx-2.8/wx/dynarray.h:486:5: note: in expansion of macro ‘_WX_DEFINE_TYPEARRAY_HELPER’
_WX_DEFINE_TYPEARRAY_HELPER(T, name, base, classexp, _WX_PTROP_NONE)
^
/usr/local/include/wx-2.8/wx/dynarray.h:669:5: note: in expansion of macro ‘_WX_DEFINE_TYPEARRAY_PTR’
_WX_DEFINE_TYPEARRAY_PTR(_wxArray##name, name, base, classdecl)
^
/usr/local/include/wx-2.8/wx/dynarray.h:835:5: note: in expansion of macro ‘WX_DEFINE_TYPEARRAY_WITH_DECL_PTR’
WX_DEFINE_TYPEARRAY_WITH_DECL_PTR(T, name, wxBaseArrayPtrVoid, wxARRAY_EMPTY expmode)
^
/usr/local/include/wx-2.8/wx/module.h:24:1: note: in expansion of macro ‘WX_DEFINE_USER_EXPORTED_ARRAY_PTR’
WX_DEFINE_USER_EXPORTED_ARRAY_PTR(wxClassInfo *, wxArrayClassInfo,
^
/usr/local/include/wx-2.8/wx/module.h: In member function ‘void wxModule::AddDependency(wxClassInfo*)’:
/usr/local/include/wx-2.8/wx/debug.h:194:43: warning: typedef ‘wxDummyCheckInt’ locally defined but not used [-Wunused-local-typedefs]
#define wxFORCE_SEMICOLON typedef int wxDummyCheckInt
^
/usr/local/include/wx-2.8/wx/debug.h:224:9: note: in expansion of macro ‘wxFORCE_SEMICOLON’
wxFORCE_SEMICOLON /* just to force a semicolon */
^
/usr/local/include/wx-2.8/wx/debug.h:233:38: note: in expansion of macro ‘wxCHECK2_MSG’
#define wxCHECK_RET(cond, msg) wxCHECK2_MSG(cond, return, msg)
^
/usr/local/include/wx-2.8/wx/module.h:71:9: note: in expansion of macro ‘wxCHECK_RET’
wxCHECK_RET( dep, wxT("NULL module dependency") );
^
mv -f .deps/libmuleappcore_a-Parser.Tpo .deps/libmuleappcore_a-Parser.Po
rm -f libmuleappcore.a
ar cru libmuleappcore.a libmuleappcore_a-AsyncDNS.o libmuleappcore_a-DeadSourceList.o libmuleappcore_a-FileArea.o libmuleappcore_a-FileAutoClose.o libmuleappcore_a-IPFilterScanner.o libmuleappcore_a-Scanner.o libmuleappcore_a-Parser.o libmuleappcore_a-PlatformSpecific.o libmuleappcore_a-RandomFunctions.o libmuleappcore_a-RC4Encrypt.o libmuleappcore_a-StateMachine.o libmuleappcore_a-TerminationProcessAmuleweb.o libmuleappcore_a-ThreadScheduler.o libmuleappcore_a-UPnPBase.o libmuleappcore_a-Entry.o libmuleappcore_a-SearchManager.o libmuleappcore_a-RoutingBin.o libmuleappcore_a-UInt128.o
ranlib libmuleappcore.a
g++ -g -W -Wall -Wshadow -Wundef -ggdb -fno-inline -fmessage-length=0 -pthread -lpthread -o amulecmd amulecmd-TextClient.o amulecmd-ExternalConnector.o amulecmd-LoggerConsole.o amulecmd-OtherFunctions.o amulecmd-NetworkFunctions.o -Llibs/common -Llibs/ec/cpp -L. -lmulecommon -lec -lmulesocket -L/usr/local/lib -pthread /usr/local/lib/libwx_baseud_net-2.8.a /usr/local/lib/libwx_baseud-2.8.a -lwxregexud-2.8 -lz -ldl -lm -lz
amulecmd-TextClient.o: En la función `PriorityToStr(int, bool)':
/home/hp/amule/amule-read-only/src/DataToText.cpp:52: referencia a `wxOnAssert(wchar_t const*, int, char const*, wchar_t const*, wchar_t const*)' sin definir
amulecmd-TextClient.o: En la función `DownloadStateToStr(int, bool)':
/home/hp/amule/amule-read-only/src/DataToText.cpp:78: referencia a `wxOnAssert(wchar_t const*, int, char const*, wchar_t const*, wchar_t const*)' sin definir
amulecmd-TextClient.o: En la función `CamulecmdApp:rocessCommand(int)':
/home/hp/amule/amule-read-only/src/TextClient.cpp:342: referencia a `wxOnAssert(wchar_t const*, int, char const*, wchar_t const*, wchar_t const*)' sin definir
/home/hp/amule/amule-read-only/src/TextClient.cpp:416: referencia a `wxOnAssert(wchar_t const*, int, char const*, wchar_t const*, wchar_t const*)' sin definir
amulecmd-TextClient.o: En la función `CamulecmdApp:rocess_Answer_v2(CECPacket const*)':
/home/hp/amule/amule-read-only/src/TextClient.cpp:644: referencia a `wxOnAssert(wchar_t const*, int, char const*, wchar_t const*, wchar_t const*)' sin definir
amulecmd-TextClient.o:/usr/local/include/wx-2.8/wx/string.h:352: más referencias a `wxOnAssert(wchar_t const*, int, char const*, wchar_t const*, wchar_t const*)' sin definir a continuación
amulecmd-TextClient.o.rodata._ZTV12CamulecmdApp[_ZTV12CamulecmdApp]+0x128): referencia a `wxAppConsole::OnAssert(wchar_t const*, int, wchar_t const*, wchar_t const*)' sin definir
amulecmd-ExternalConnector.o: En la función `CaMuleExternalConnector::OnAssertFailure(wchar_t const*, int, wchar_t const*, wchar_t const*, wchar_t const*)':
/home/hp/amule/amule-read-only/src/ExternalConnector.cpp:655: referencia a `wxAppConsole::OnAssertFailure(wchar_t const*, int, wchar_t const*, wchar_t const*, wchar_t const*)' sin definir
amulecmd-ExternalConnector.o: En la función `wxStringBase::at(unsigned long) const':
/usr/local/include/wx-2.8/wx/string.h:430: referencia a `wxOnAssert(wchar_t const*, int, char const*, wchar_t const*, wchar_t const*)' sin definir
amulecmd-ExternalConnector.o: En la función `wxStringBase::at(unsigned long)':
/usr/local/include/wx-2.8/wx/string.h:433: referencia a `wxOnAssert(wchar_t const*, int, char const*, wchar_t const*, wchar_t const*)' sin definir
amulecmd-ExternalConnector.o.rodata._ZTV23CaMuleExternalConnector[_ZTV23CaMuleExternalConnector]+0x128): referencia a `wxAppConsole::OnAssert(wchar_t const*, int, wchar_t const*, wchar_t const*)' sin definir
amulecmd-OtherFunctions.o: En la función `GetPassword(bool)':
/home/hp/amule/amule-read-only/src/OtherFunctions.cpp:1230: referencia a `wxOnAssert(wchar_t const*, int, char const*, wchar_t const*, wchar_t const*)' sin definir
libs/common/libmulecommon.a(Format.o): En la función `CFormat::Init(wxString const&)':
/home/hp/amule/amule-read-only/src/libs/common/Format.cpp:201: referencia a `wxOnAssert(wchar_t const*, int, char const*, wchar_t const*, wchar_t const*)' sin definir
/home/hp/amule/amule-read-only/src/libs/common/Format.cpp:217: referencia a `wxOnAssert(wchar_t const*, int, char const*, wchar_t const*, wchar_t const*)' sin definir
/home/hp/amule/amule-read-only/src/libs/common/Format.cpp:329: referencia a `wxOnAssert(wchar_t const*, int, char const*, wchar_t const*, wchar_t const*)' sin definir
libs/common/libmulecommon.a(Format.o): En la función `void CFormat:rocessArgument(std::_List_iterator, double)':
/home/hp/amule/amule-read-only/src/libs/common/Format.cpp:400: referencia a `wxOnAssert(wchar_t const*, int, char const*, wchar_t const*, wchar_t const*)' sin definir
libs/common/libmulecommon.a(Format.o):/home/hp/amule/amule-read-only/src/libs/common/Format.cpp:435: más referencias a `wxOnAssert(wchar_t const*, int, char const*, wchar_t const*, wchar_t const*)' sin definir a continuación
collect2: error: ld returned 1 exit status
make[3]: *** [amulecmd] Error 1
make[3]: se sale del directorio «/home/hp/amule/amule-read-only/src»
make[2]: *** [all-recursive] Error 1
make[2]: se sale del directorio «/home/hp/amule/amule-read-only/src»
make[1]: *** [all-recursive] Error 1
make[1]: se sale del directorio «/home/hp/amule/amule-read-only»
make: *** [all] Error 2[/code]
Quote    Reply   
Remove this ad
Remove this ad

#1 [url]

May 11 14 9:05 AM

Re: error when compiling for daemon and web...

Hi.

OK, I solved the problem so now I can compile and build the latest SVN without any problem. I forget to install some deps, but now I can run amuled and amuleweb.

Now, the problem comes with amuleweb, sometimes the service crash and I can't enter to the web interfacethe. Log file has this entries:

[code]2014-05-11 09:44:36: Logger.cpp(332): 09:44:36: Error: Failed to modify descriptor 36 in epoll descriptor 6 (error 2: there is no such file or directory)[/code]

[code] 2014-05-11 09:44:54: TerminationProcess.cpp(48): Command ''amuleweb' '--amule-config-file=/home/user/.aMule/amule.conf'' with pid '1125' has finished with code '-6'.[/code]

Please someone, can help to fix this?, thanks.

Quote    Reply   
Add Reply

Quick Reply

bbcode help